#
closed
Errors while the running the app

PS C:\Users\aditi\Downloads\codecanyon-7LpXl7nB-explore-places-flutter-places-app-with-firebase-backend-place-app-\MightyExplorePlaceCode\Flutter App\exploreplaces_30_4_24\exploreplaces> flutter run

Launching lib\main.dart on SM M346B in debug mode...

Could not write file to C:\Users\aditi\Downloads\codecanyon-7LpXl7nB-explore-places-flutter-places-app-with-firebase-backend-place-app-\MightyExplorePlaceCode\Flutter App\exploreplaces_30_4_24\exploreplaces\build\app\intermediates\flutter\debug\flutter_assets\shaders/ink_sparkle.frag

Target debug_android_application failed: ShaderCompilerException: Shader compilation of "D:\flutter_windows_3.24.0-stable\flutter\packages\flutter\lib\src\material\shaders\ink_spar

kle.frag" to "C:\Users\aditi\Downloads\codecanyon-7LpXl7nB-explore-places-flutter-places-app-with-firebase-backend-place-app-\MightyExplorePlaceCode\Flutter App\exploreplaces_30_4_24\exploreplaces\build\app\intermediates\flutter\debug\flutter_assets\shaders/ink_sparkle.frag" failed with exit code 1.

impellerc stdout:

impellerc stderr:

Could not write file to C:\Users\aditi\Downloads\codecanyon-7LpXl7nB-explore-places-flutter-places-app-with-firebase-backend-place-app-\MightyExplorePlaceCode\Flutter App\exploreplaces_30_4_24\exploreplaces\build\app\intermediates\flutter\debug\flutter_assets\shaders/ink_sparkle.frag

FAILURE: Build failed with an exception.

* What went wrong:

Execution failed for task ':app:compileFlutterBuildDebug'.

> Process 'command 'D:\flutter_windows_3.24.0-stable\flutter\bin\flutter.bat'' finished with non-zero exit value 1

* Try:

> Run with --stacktrace option to get the stack trace.

> Run with --info or --debug option to get more log output.

> Run with --scan to get full insights.

* Get more help at https://help.gradle.org

BUILD FAILED in 26s

Running Gradle task 'assembleDebug'...                             27.0s

Error: Gradle task assembleDebug failed with exit code 1

ATTACHED FILES

Asked 1 year ago on August 9, 2024 1:03 PM Comments 1 times


  1. Generic placeholder image

    Kenia replied

    Hello,

    Which Flutter version is used?

    Please make sure to use Flutter 3.19 and Dart 3.3.

    Thanks & Regards,
    - Kenia

Recent Tickets
river is not receiving ri... 7 months ago on January 29, 2025 9:03 AM I would like to know how ... 18 hours ago on August 29, 2025 1:45 AM error - Mighty Web Webvie... 2 days ago on August 27, 2025 9:21 AM Google notification We wi... 2 days ago on August 27, 2025 1:32 AM Privacy policy does not o... 1 week ago on August 22, 2025 12:51 PM Face firebase error runti... 1 week ago on August 20, 2025 8:07 AM Clarification on Ratings ... 1 week ago on August 19, 2025 10:39 AM the file you sent me the ... 1 week ago on August 18, 2025 4:25 AM how to change lbs to kg a... 2 weeks ago on August 15, 2025 9:40 AM error sending to apple co... 2 weeks ago on August 12, 2025 4:21 AM